Announcement

Announcement Module
Collapse
No announcement yet.

MYSQL benchmark

Page Title Module
Move Remove Collapse
X
Conversation Detail Module
Collapse
  • Filter
  • Time
  • Show
Clear All
new posts

  • MYSQL benchmark

    Sir when I am try to install the super-smack-1.2 benchmark on my obuntu 9.04 regular machine I am geting the following error.
    In file included from client.h:29,
    from super-smack.cc:38:
    dictionary.h: In member function 'void Unique_dictionary::set_template(const char*)':
    dictionary.h:93: error: 'strlen' was not declared in this scope
    super-smack.cc: In function 'void set_parse_file(char*)':
    super-smack.cc:65: warning: deprecated conversion from string constant to 'char*'
    super-smack.cc: In function 'void set_db_type(const char*)':
    super-smack.cc:72: warning: deprecated conversion from string constant to 'char*'
    super-smack.cc: In function 'void print_engines()':
    super-smack.cc:126: error: 'strlen' was not declared in this scope
    make[2]: *** [super-smack.o] Error 1
    make[2]: Leaving directory `/home/jamsheer/Downloads/super-smack-1.2/src'
    make[1]: *** [all-recursive] Error 1
    make[1]: Leaving directory `/home/jamsheer/Downloads/super-smack-1.2'
    make: *** [all-recursive-am] Error 2

    so can u clarify the above issue. so that can move my academic project further
    Your sincerely.
    Jamsheer AK

  • #2
    Hi Jamsheer,

    did you tried to get some help by the Smack community?

    Istvan

    Comment


    • #3
      http://linux-yogi.blogspot.com/2009/11/super-smack-compiling -error-on-amd64.html

      Comment

      Working...
      X