Announcement

Announcement Module
Collapse
No announcement yet.

Percona on Slackware 14 - build error

Page Title Module
Move Remove Collapse
X
Conversation Detail Module
Collapse
  • Filter
  • Time
  • Show
Clear All
new posts

  • Percona on Slackware 14 - build error

    # make
    [ 0%] Built target INFO_BIN
    [ 0%] Built target INFO_SRC
    [ 0%] Built target abi_check
    [ 2%] Built target zlib
    [ 4%] Built target yassl
    [ 7%] Built target taocrypt
    [ 12%] Built target readline
    [ 18%] Built target strings
    [ 33%] Built target mysys
    [ 33%] Built target dbug
    [ 33%] Built target comp_err
    [ 33%] Built target GenError
    [ 33%] Built target blackhole
    [ 33%] Built target archive
    [ 33%] Built target csv
    [ 41%] Built target myisam
    [ 41%] Built target myisam_ftdump
    [ 41%] Built target myisamchk
    [ 41%] Built target myisamlog
    [ 41%] Built target myisampack
    [ 45%] Built target perfschema
    [ 45%] Built target mytap
    [ 45%] Built target pfs-t
    [ 45%] Built target pfs_instr-oom-t
    [ 45%] Built target pfs_instr-t
    [ 45%] Built target pfs_instr_class-oom-t
    [ 45%] Built target pfs_instr_class-t
    [ 45%] Built target federated
    [ 58%] Built target innobase
    [ 62%] Built target heap
    [ 62%] Built target hp_test1
    [ 63%] Built target hp_test2
    [ 67%] Built target myisammrg
    [ 68%] Built target mysqlservices
    [ 69%] Built target daemon_example
    [ 69%] Built target ftexample
    [ 70%] Built target audit_null
    [ 70%] Built target semisync_master
    [ 71%] Built target semisync_slave
    [ 71%] Built target auth
    [ 71%] Built target auth_socket
    [ 71%] Built target auth_test_plugin
    [ 72%] Built target qa_auth_client
    [ 72%] Built target qa_auth_interface
    [ 72%] Built target qa_auth_server
    [ 73%] Built target vio
    [ 73%] Built target regex
    [ 73%] Built target thr_lock
    [ 74%] Built target clientlib
    [ 74%] Built target libmysql
    [ 75%] Built target mysqlclient
    [ 75%] Built target symlink_libmysqlclient_r.a
    [ 76%] Built target symlink_libmysqlclient_r.so
    [ 76%] Built target symlink_libmysqlclient_r.so.18
    [ 76%] Built target symlink_libmysqlclient_r.so.18.0.0
    [ 76%] Built target base64-t
    [ 76%] Built target bitmap-t
    [ 76%] Built target lf-t
    [ 76%] Built target my_atomic-t
    [ 76%] Built target my_malloc-t
    [ 76%] Built target my_rdtsc-t
    [ 76%] Built target my_vsnprintf-t
    [ 76%] Built target innochecksum
    [ 77%] Built target my_print_defaults
    [ 77%] Built target mysql_waitpid
    [ 77%] Built target perror
    [ 77%] Built target replace
    [ 78%] Built target resolve_stack_dump
    [ 78%] Built target resolveip
    [ 79%] Built target bug25714
    [ 79%] Built target mysql_client_test
    [ 79%] Built target mysql
    [ 79%] Built target comp_sql
    [ 79%] Built target GenFixPrivs
    [ 79%] Built target mysql_upgrade
    [ 79%] Built target mysqladmin
    [ 79%] Built target mysqlbinlog
    [ 79%] Built target mysqlcheck
    [ 79%] Built target mysqldump
    [ 79%] Built target mysqlimport
    [ 79%] Built target mysqlshow
    [ 79%] Built target mysqlslap
    [ 79%] Built target mysqltest
    [ 79%] Built target gen_lex_hash
    [ 80%] Built target mysql_tzinfo_to_sql
    [ 80%] Generating sql_yacc.cc, sql_yacc.h
    make[2]: *** [sql/sql_yacc.cc] Error 141
    make[1]: *** [sql/CMakeFiles/GenServerSource.dir/all] Error 2
    make: *** [all] Error 2

    Any ideas? Thx

  • #2
    Hi,

    Looks like you are facing the same which is described here. As sql_yacc.h doesn't regenerate so you need to remove sql/sql_yacc.h sql/sql_yacc.сс and try to build again.

    Please check this discussion for more details.
    https://groups.google.com/forum/#!to...on/lbzNXO9Kmj0

    Comment

    Working...
    X